Project generator compilation error in ubuntu 14.04

So I compiled OF just fine but I’m having difficulty with the project generator.
Here’s the terminal output:

collect2: error: 1d return 1 exit status
make[1]: *** [bin/projectGeneratorSimple] Error 1
make[1]: Leaving directory …apps/projectGenerator/projectGeneratorSimple
make: *** [Release] Error 2
there has been a problem compiling the project generator
please report this problem in the forums

Any help would be greatly appreciated : )

is this with 0.8.4?

yes