Problems with OfxAndroid on Windows

Greetings,

I’m having some problems on getting OfxAndroid to work on windows.
I’m following this tutorial: http://www.multigesture.net/articles/how-to-setup-openframeworks-for-android-on-windows/

The problem I’m getting is an Error 127 in several places of my workspace:

  
  
Description	Resource	Path	Location	Type  
make: *** [AndroidRelease] Error 2	androidSoundPlayerExample		 	C/C++ Problem  
make[1]: *** [obj/androidRelease/src/main.o] Error 127	androidSoundPlayerExample		 	C/C++ Problem  
make: *** [AndroidRelease] Error 2	androidAccelerometerExample		 	C/C++ Problem  
make: *** [AndroidRelease] Error 2	androidOpenCVFaceExample		 	C/C++ Problem  
make[1]: *** [obj/androidRelease/src/main.o] Error 127	androidAccelerometerExample		 	C/C++ Problem  
make[1]: *** [obj/androidRelease/src/main.o] Error 127	androidOpenCVFaceExample		 	C/C++ Problem  
make[1]: *** [obj/androidRelease/src/main.o] Error 127	android3DModelLoaderExample		 	C/C++ Problem  
make: *** [AndroidRelease] Error 2	android3DModelLoaderExample		 	C/C++ Problem  
The project cannot be built until build path errors are resolved	androidTouchExample		Unknown	Java Problem  
make[1]: *** [obj/DebugAndroid/openFrameworks/3d/of3dUtils.o] Error 127	openFrameworks		 	C/C++ Problem  
make[1]: *** [obj/androidRelease/src/main.o] Error 127	androidSwipeExample		 	C/C++ Problem  
Command canceled	androidAdvanced3DExample		 	C/C++ Problem  
make[1]: *** Waiting for unfinished jobs....	openFrameworks		 	C/C++ Problem  
make: *** [AndroidRelease] Error 2	androidSwipeExample		 	C/C++ Problem  
make[1]: *** [obj/DebugAndroid/openFrameworks/3d/ofCamera.o] Error 127	openFrameworks		 	C/C++ Problem  
make[1]: *** wait: No children.  Stop.	openFrameworks		 	C/C++ Problem  
make: *** [android] Error 2	openFrameworks		 	C/C++ Problem  
make[1]: *** [obj/androidRelease/src/main.o] Error 127	androidImageExample		 	C/C++ Problem  
make: *** [AndroidRelease] Error 2	androidImageExample		 	C/C++ Problem  
make: *** [AndroidRelease] Error 2	androidAudioExample		 	C/C++ Problem  
make[1]: *** [obj/androidRelease/src/main.o] Error 127	androidOpenCVExample		 	C/C++ Problem  
make: *** [AndroidRelease] Error 2	androidPolygonExample		 	C/C++ Problem  
make[1]: *** [obj/androidRelease/src/main.o] Error 127	androidAudioExample		 	C/C++ Problem  
make: *** [AndroidRelease] Error 2	androidOpenCVExample		 	C/C++ Problem  
make[1]: *** [obj/androidRelease/src/main.o] Error 127	androidPolygonExample		 	C/C++ Problem  
make: *** [AndroidRelease] Error 2	androidCameraExample		 	C/C++ Problem  
Command canceled	androidTouchExample		 	C/C++ Problem  
make[1]: *** [obj/androidRelease/src/main.o] Error 127	androidCameraExample		 	C/C++ Problem  
make[1]: *** [obj/androidRelease/src/main.o] Error 127	androidAssimpExample		 	C/C++ Problem  
make[1]: *** [obj/androidRelease/src/main.o] Error 127	androidVBOExample		 	C/C++ Problem  
make: *** [AndroidRelease] Error 2	androidAssimpExample		 	C/C++ Problem  
make: *** [AndroidRelease] Error 2	androidVBOExample		 	C/C++ Problem  
Invalid arguments '  
Candidates are:  
void ofRunApp(ofPtr<ofBaseApp>)  
void ofRunApp(ofBaseApp *)  
'	main.cpp	/androidAccelerometerExample/src	line 23	Semantic Error  
The project cannot be built until build path errors are resolved	androidVBOExample		Unknown	Java Problem  
Method 'getForce' could not be resolved	testApp.cpp	/androidAccelerometerExample/src	line 15	Semantic Error  
Symbol 'ofxAccelerometer' could not be resolved	testApp.cpp	/androidAccelerometerExample/src	line 15	Semantic Error  
Method 'setup' could not be resolved	testApp.cpp	/androidAccelerometerExample/src	line 6	Semantic Error  
Symbol 'ofxAccelerometer' could not be resolved	testApp.cpp	/androidAccelerometerExample/src	line 6	Semantic Error  
make: *** [AndroidRelease] Error 2	androidFontExample		 	C/C++ Problem  
make[1]: *** [obj/androidRelease/src/main.o] Error 127	androidFontExample		 	C/C++ Problem  
Type 'ofxAndroidSwipeDir' could not be resolved	testApp.cpp	/androidAccelerometerExample/src	line 85	Semantic Error  
Member declaration not found	testApp.cpp	/androidAccelerometerExample/src	line 85	Semantic Error  
make: *** [AndroidRelease] Error 2	androidEmptyExample		 	C/C++ Problem  
make[1]: *** [obj/androidRelease/src/main.o] Error 127	androidEmptyExample		 	C/C++ Problem  
  
  

Can anyone help me, please?