ofxPoco issues on Arch Linux

Is this a known issue? Seems to be related to openSSL.
Any help is greatly appreciated.

/home/thinkpad2000/Code/of_v20180511_linux64gcc6_release/addons/ofxPoco/libs/poco/lib/linux64/libPocoCrypto.a(OpenSSLInitializer.o):OpenSSLInitializer.cpp:function Poco::Crypto::OpenSSLInitializer::uninitialize(): error: undefined reference to ‘EVP_cleanup’
/home/thinkpad2000/Code/of_v20180511_linux64gcc6_release/addons/ofxPoco/libs/poco/lib/linux64/libPocoCrypto.a(OpenSSLInitializer.o):OpenSSLInitializer.cpp:function Poco::Crypto::OpenSSLInitializer::uninitialize(): error: undefined reference to ‘ERR_free_strings’
/home/thinkpad2000/Code/of_v20180511_linux64gcc6_release/addons/ofxPoco/libs/poco/lib/linux64/libPocoCrypto.a(OpenSSLInitializer.o):OpenSSLInitializer.cpp:function Poco::Crypto::OpenSSLInitializer::uninitialize(): error: undefined reference to ‘CRYPTO_set_locking_callback’
/home/thinkpad2000/Code/of_v20180511_linux64gcc6_release/addons/ofxPoco/libs/poco/lib/linux64/libPocoCrypto.a(OpenSSLInitializer.o):OpenSSLInitializer.cpp:function Poco::Crypto::OpenSSLInitializer::uninitialize(): error: undefined reference to ‘CRYPTO_set_id_callback’
/home/thinkpad2000/Code/of_v20180511_linux64gcc6_release/addons/ofxPoco/libs/poco/lib/linux64/libPocoCrypto.a(OpenSSLInitializer.o):OpenSSLInitializer.cpp:function Poco::Crypto::OpenSSLInitializer::initialize(): error: undefined reference to ‘SSL_library_init’
/home/thinkpad2000/Code/of_v20180511_linux64gcc6_release/addons/ofxPoco/libs/poco/lib/linux64/libPocoCrypto.a(OpenSSLInitializer.o):OpenSSLInitializer.cpp:function Poco::Crypto::OpenSSLInitializer::initialize(): error: undefined reference to ‘SSL_load_error_strings’
/home/thinkpad2000/Code/of_v20180511_linux64gcc6_release/addons/ofxPoco/libs/poco/lib/linux64/libPocoCrypto.a(OpenSSLInitializer.o):OpenSSLInitializer.cpp:function Poco::Crypto::OpenSSLInitializer::initialize(): error: undefined reference to ‘OPENSSL_add_all_algorithms_noconf’
/home/thinkpad2000/Code/of_v20180511_linux64gcc6_release/addons/ofxPoco/libs/poco/lib/linux64/libPocoCrypto.a(OpenSSLInitializer.o):OpenSSLInitializer.cpp:function Poco::Crypto::OpenSSLInitializer::initialize(): error: undefined reference to ‘CRYPTO_num_locks’
/home/thinkpad2000/Code/of_v20180511_linux64gcc6_release/addons/ofxPoco/libs/poco/lib/linux64/libPocoCrypto.a(OpenSSLInitializer.o):OpenSSLInitializer.cpp:function Poco::Crypto::OpenSSLInitializer::initialize(): error: undefined reference to ‘CRYPTO_set_locking_callback’
/home/thinkpad2000/Code/of_v20180511_linux64gcc6_release/addons/ofxPoco/libs/poco/lib/linux64/libPocoCrypto.a(OpenSSLInitializer.o):OpenSSLInitializer.cpp:function Poco::Crypto::OpenSSLInitializer::initialize(): error: undefined reference to ‘CRYPTO_set_id_callback’
/home/thinkpad2000/Code/of_v20180511_linux64gcc6_release/addons/ofxPoco/libs/poco/lib/linux64/libPocoCrypto.a(OpenSSLInitializer.o):OpenSSLInitializer.cpp:function Poco::Crypto::OpenSSLInitializer::initialize(): error: undefined reference to ‘CRYPTO_set_dynlock_create_callback’
/home/thinkpad2000/Code/of_v20180511_linux64gcc6_release/addons/ofxPoco/libs/poco/lib/linux64/libPocoCrypto.a(OpenSSLInitializer.o):OpenSSLInitializer.cpp:function Poco::Crypto::OpenSSLInitializer::initialize(): error: undefined reference to ‘CRYPTO_set_dynlock_lock_callback’
/home/thinkpad2000/Code/of_v20180511_linux64gcc6_release/addons/ofxPoco/libs/poco/lib/linux64/libPocoCrypto.a(OpenSSLInitializer.o):OpenSSLInitializer.cpp:function Poco::Crypto::OpenSSLInitializer::initialize(): error: undefined reference to ‘CRYPTO_set_dynlock_destroy_callback’
/home/thinkpad2000/Code/of_v20180511_linux64gcc6_release/addons/ofxPoco/libs/poco/lib/linux64/libPocoCrypto.a(OpenSSLInitializer.o):OpenSSLInitializer.cpp:function Poco::Crypto::OpenSSLInitializer::uninitialize(): error: undefined reference to ‘CONF_modules_free’
collect2: error: ld returned 1 exit status
make[1]: *** [/home/thinkpad2000/Code/of_v20180511_linux64gcc6_release/libs/openFrameworksCompiled/project/makefileCommon/compile.project.mk:405: bin/camtest2] Error 1
make[1]: Leaving directory ‘/home/thinkpad2000/Code/of_v20180511_linux64gcc6_release/apps/myApps/camtest2’
make: *** [/home/thinkpad2000/Code/of_v20180511_linux64gcc6_release/libs/openFrameworksCompiled/project/makefileCommon/compile.project.mk:129: Release] Error 2