ofXARToolKitplus

hello,
I am trying to Incorporate ofxARToolKitPLus for android
I am using ubuntu and NDK5b i.e.gcc-4.4

I am getting the following error…

…/…/…/addons/ofxARToolkitPlus/include/ARToolKitPlus/…/…/src/core/arDetectMarker.cxx: In member function ‘virtual int ARToolKitPlus::TrackerImpl<__PATTERN_SIZE_X, __PATTERN_SIZE_Y, __PATTERN_SAMPLE_NUM, __MAX_LOAD_PATTERNS, __MAX_IMAGE_PATTERNS>::arDetectMarker(ARToolKitPlus::ARUint8*, int, ARToolKitPlus::ARMarkerInfo**, int*)’:
…/…/…/addons/ofxARToolkitPlus/include/ARToolKitPlus/…/…/src/core/arDetectMarker.cxx:148: error: parse error in template argument list
…/…/…/addons/ofxARToolkitPlus/include/ARToolKitPlus/…/…/src/core/arDetectMarker.cxx: In member function ‘int ARToolKitPlus::TrackerImpl<__PATTERN_SIZE_X, __PATTERN_SIZE_Y, __PATTERN_SAMPLE_NUM, __MAX_LOAD_PATTERNS, __MAX_IMAGE_PATTERNS>::arDetectMarker(ARToolKitPlus::ARUint8*, int, ARToolKitPlus::ARMarkerInfo**, int*) [with int __PATTERN_SIZE_X = 6, int __PATTERN_SIZE_Y = 6, int __PATTERN_SAMPLE_NUM = 6, int __MAX_LOAD_PATTERNS = 32, int __MAX_IMAGE_PATTERNS = 32]’:
…/…/…/addons/ofxARToolkitPlus/src/ofxARToolkitPlus.cpp:526: instantiated from here
…/…/…/addons/ofxARToolkitPlus/include/ARToolKitPlus/…/…/src/core/arDetectMarker.cxx:148: error: ‘count’ is not a member template function
…/…/…/addons/ofxARToolkitPlus/include/ARToolKitPlus/…/…/src/core/arBitFieldPattern.cxx: At global scope:
…/…/…/addons/ofxARToolkitPlus/include/ARToolKitPlus/…/…/src/core/arBitFieldPattern.cxx:104: warning: ‘void ARToolKitPlus::generatePatternSimple(int, ARToolKitPlus::IDPATTERN&)’ defined but not used
…/…/…/addons/ofxARToolkitPlus/include/ARToolKitPlus/…/…/src/core/arBitFieldPattern.cxx:114: warning: ‘void ARToolKitPlus::generatePatternBCH(int, ARToolKitPlus::IDPATTERN&)’ defined but not used
make[1]: *** [obj/androidDebug/addons/ofxARToolkitPlus/src/ofxARToolkitPlus.o] Error 1
make: *** [AndroidDebug] Error 2
:frowning:
:frowning:

any Idea…