of_v0.9.4_RC1_osx_release not all QTKit references removed

System Version: OS X 10.11.6 (15G1004)
Kernel Version: Darwin 15.6.0
Xcode Version: 8.0 (8A218a)
Build Failed in folder osx running

./buildAllExamples.sh

src/ofApp.h:26:9: error: use of undeclared identifier ‘ofQTKitGrabber’
ofPtr vidRecorder;
^
src/ofApp.h:30:19: error: unknown type name ‘ofVideoSavedEventArgs’
void videoSaved(ofVideoSavedEventArgs& e);
^
/Users/edward.hartley/Projects/2016_Video_Segments/of_v0.9.4_RC1_osx_release/examples/video/osxVideoRecorderExample/src/main.cpp:12:2: error:
no matching function for call to ‘ofRunApp’
ofRunApp( new ofApp());
^~~~~~~~
In file included from /Users/edward.hartley/Projects/2016_Video_Segments/of_v0.9.4_RC1_osx_release/examples/video/osxVideoRecorderExample/src/main.cpp:1:
In file included from …/…/…/libs/openFrameworks/ofMain.h:45:
In file included from …/…/…/libs/openFrameworks/gl/ofGLRenderer.h:6:
In file included from …/…/…/libs/openFrameworks/graphics/of3dGraphics.h:17:
In file included from …/…/…/libs/openFrameworks/3d/of3dPrimitives.h:5:
In file included from …/…/…/libs/openFrameworks/3d/ofNode.h:6:
…/…/…/libs/openFrameworks/app/ofAppRunner.h:50:5: note: candidate function
not viable: no known conversion from ‘ofApp *’ to ‘shared_ptr’
for 1st argument
int ofRunApp(shared_ptr OFSA);
^
…/…/…/libs/openFrameworks/app/ofAppRunner.h:51:5: note: candidate function
not viable: no known conversion from ‘ofApp *’ to ‘ofBaseApp *’ for 1st
argument
int ofRunApp(ofBaseApp * OFSA = nullptr); // will be deprecated
^
…/…/…/libs/openFrameworks/app/ofAppRunner.h:52:6: note: candidate function
not viable: requires 2 arguments, but 1 was provided
void ofRunApp(shared_ptr window, shared_ptr app);
^
3 errors generated.

** BUILD FAILED **