Error while running project in vs2017

#1

Greetings i faced that error

1> Creating library bin\kinect.lib and object bin\kinect.exp
1>libusbemu.obj : error LNK2001: unresolved external symbol _usb_open
1>libusbemu.obj : error LNK2001: unresolved external symbol _usb_close
1>libusbemu.obj : error LNK2001: unresolved external symbol _usb_get_string
1>libusbemu.obj : error LNK2001: unresolved external symbol _usb_get_string_simple
1>libusbemu.obj : error LNK2001: unresolved external symbol _usb_bulk_write
1>libusbemu.obj : error LNK2001: unresolved external symbol _usb_bulk_read
1>libusbemu.obj : error LNK2001: unresolved external symbol _usb_control_msg
1>libusbemu.obj : error LNK2001: unresolved external symbol _usb_set_configuration
1>libusbemu.obj : error LNK2001: unresolved external symbol _usb_claim_interface
1>libusbemu.obj : error LNK2001: unresolved external symbol _usb_release_interface
1>libusbemu.obj : error LNK2001: unresolved external symbol _usb_set_altinterface
1>libusbemu.obj : error LNK2001: unresolved external symbol _usb_strerror
1>libusbemu.obj : error LNK2001: unresolved external symbol _usb_init
1>libusbemu.obj : error LNK2001: unresolved external symbol _usb_set_debug
1>libusbemu.obj : error LNK2001: unresolved external symbol _usb_find_busses
1>libusbemu.obj : error LNK2001: unresolved external symbol _usb_find_devices
1>libusbemu.obj : error LNK2001: unresolved external symbol _usb_get_busses
1>libusbemu.obj : error LNK2001: unresolved external symbol _usb_isochronous_setup_async
1>libusbemu.obj : error LNK2001: unresolved external symbol _usb_submit_async
1>libusbemu.obj : error LNK2001: unresolved external symbol _usb_reap_async_nocancel
1>libusbemu.obj : error LNK2001: unresolved external symbol _usb_cancel_async
1>libusbemu.obj : error LNK2001: unresolved external symbol _usb_free_async
1>cameras.obj : error LNK2001: unresolved external symbol “int __cdecl fnusb_get_max_iso_packet_size(struct fnusb_dev *,unsigned char,int)” (?fnusb_get_max_iso_packet_size@@YAHPAUfnusb_dev@@EH@Z)
1>bin\kinect.exe : fatal error LNK1120: 23 unresolved externals
1>Done building project “kinect.vcxproj” – FAILED.
========== Build: 0 succeeded, 1 failed, 1 up-to-date, 0 skipped ==========