Error compiling Project Generator

Hi All,

I’ve been trying this for a week and I have officially given up and now asking for your help.
I am trying to install openframeworks on an opensuse distro based on _https://github.com/prusnak/openFrameworks

The problem is everytime I run ./compilePG.sh, I run into the following error:

g++ -o bin/projectGeneratorSimple obj/linux64/Release/src/testApp.o obj/linux64/Release/src/main.o obj/linux64/Release/src/pugixmlLib/src/pugixml.o obj/linux64/Release/src/utils/Utils.o obj/linux64/Release/src/projects/CBWinProject.o obj/linux64/Release/src/projects/CBLinuxProject.o obj/linux64/Release/src/projects/visualStudioProject.o obj/linux64/Release/src/projects/baseProject.o obj/linux64/Release/src/projects/xcodeProject.o obj/linux64/Release/src/addons/ofAddon.o …/…/…/addons/obj/linux64/Release/ofxGui/src/ofxSlider.o …/…/…/addons/obj/linux64/Release/ofxGui/src/ofxToggle.o …/…/…/addons/obj/linux64/Release/ofxGui/src/ofxButton.o …/…/…/addons/obj/linux64/Release/ofxGui/src/ofxSliderGroup.o …/…/…/addons/obj/linux64/Release/ofxGui/src/ofxGuiGroup.o …/…/…/addons/obj/linux64/Release/ofxGui/src/ofxBaseGui.o …/…/…/addons/obj/linux64/Release/ofxGui/src/ofxPanel.o …/…/…/addons/obj/linux64/Release/ofxGui/src/ofxLabel.o …/…/…/addons/obj/linux64/Release/ofxXmlSettings/src/ofxXmlSettings.o …/…/…/addons/obj/linux64/Release/ofxXmlSettings/libs/tinyxmlerror.o …/…/…/addons/obj/linux64/Release/ofxXmlSettings/libs/tinyxml.o …/…/…/addons/obj/linux64/Release/ofxXmlSettings/libs/tinyxmlparser.o …/…/…/libs/openFrameworksCompiled/lib/linux64/libopenFrameworks.a -Wl,-rpath=./libs:./bin/libs -Wl,–as-needed -Wl,–gc-sections -L…/…/…/libs/fmodex/lib/linux64/ -lfmodex …/…/…/libs/glfw/lib/linux64/libglfw3.a …/…/…/libs/kiss/lib/linux64/libkiss.a …/…/…/libs/rtAudio/lib/linux64/libRtAudio.a …/…/…/libs/tess2/lib/linux64/libtess2.a …/…/…/libs/poco/lib/linux64/libPocoNet.a …/…/…/libs/poco/lib/linux64/libPocoXML.a …/…/…/libs/poco/lib/linux64/libPocoUtil.a …/…/…/libs/poco/lib/linux64/libPocoFoundation.a …/…/…/libs/poco/lib/linux64/libPocoNetSSL.a …/…/…/libs/poco/lib/linux64/libPocoNet.a …/…/…/libs/poco/lib/linux64/libPocoCrypto.a …/…/…/libs/poco/lib/linux64/libPocoUtil.a …/…/…/libs/poco/lib/linux64/libPocoXML.a …/…/…/libs/poco/lib/linux64/libPocoFoundation.a -L/lib64 -lcairo -lz -lgstapp-1.0 -lgstvideo-1.0 -lgstbase-1.0 -lgstreamer-1.0 -lgobject-2.0 -lglib-2.0 -ludev -lfontconfig -lfreetype -lsndfile -lopenal -lssl -lcrypto -lpulse-simple -lpulse -lasound -lGLEW -lGLU -lGL -lmpg123 -lglut -lX11 -lXrandr -lXxf86vm -lXi -lXcursor -ldl -lpthread -lfreeimage
/usr/lib64/gcc/x86_64-suse-linux/4.8/…/…/…/…/x86_64-suse-linux/bin/ld: cannot find -lXrandr
/usr/lib64/gcc/x86_64-suse-linux/4.8/…/…/…/…/x86_64-suse-linux/bin/ld: cannot find -lXi
/usr/lib64/gcc/x86_64-suse-linux/4.8/…/…/…/…/x86_64-suse-linux/bin/ld: cannot find -lXcursor
collect2: error: ld returned 1 exit status
…/…/…/libs/openFrameworksCompiled/project/makefileCommon/compile.project.mk:296: recipe for target ‘bin/projectGeneratorSimple’ failed
make[1]: *** [bin/projectGeneratorSimple] Error 1
make[1]: Leaving directory ‘/home/Lex/Downloads/of_v0.8.4_linux64_release/apps/projectGenerator/projectGeneratorSimple’
…/…/…/libs/openFrameworksCompiled/project/makefileCommon/compile.project.mk:126: recipe for target ‘Release’ failed
make: *** [Release] Error 2
there has been a problem compiling the projectGenerator
please report this problem in the forums

I’d be glad if anyone could help me out.

Thank you!

Lekan