Debug/Release Modes errors - VS2017 / Win10

My project runs in Debug mode but when I try to run it in Release mode I get all this:

1>------ Build started: Project: ww004, Configuration: Release Win32 ------
1>openframeworksLib_debug.lib(ofThread.obj) : error LNK2038: mismatch detected for '_ITERATOR_DEBUG_LEVEL': value '2' doesn't match value '0' in ofxThreadedImageLoader.obj
1>openframeworksLib_debug.lib(ofThread.obj) : error LNK2038: mismatch detected for 'RuntimeLibrary': value 'MDd_DynamicDebug' doesn't match value 'MD_DynamicRelease' in ofxThreadedImageLoader.obj
1>openframeworksLib_debug.lib(ofLog.obj) : error LNK2038: mismatch detected for '_ITERATOR_DEBUG_LEVEL': value '2' doesn't match value '0' in ofxThreadedImageLoader.obj
1>openframeworksLib_debug.lib(ofLog.obj) : error LNK2038: mismatch detected for 'RuntimeLibrary': value 'MDd_DynamicDebug' doesn't match value 'MD_DynamicRelease' in ofxThreadedImageLoader.obj
1>openframeworksLib_debug.lib(ofEvents.obj) : error LNK2038: mismatch detected for '_ITERATOR_DEBUG_LEVEL': value '2' doesn't match value '0' in ofxThreadedImageLoader.obj
1>openframeworksLib_debug.lib(ofEvents.obj) : error LNK2038: mismatch detected for 'RuntimeLibrary': value 'MDd_DynamicDebug' doesn't match value 'MD_DynamicRelease' in ofxThreadedImageLoader.obj
1>openframeworksLib_debug.lib(ofAppRunner.obj) : error LNK2038: mismatch detected for '_ITERATOR_DEBUG_LEVEL': value '2' doesn't match value '0' in ofxThreadedImageLoader.obj
1>openframeworksLib_debug.lib(ofAppRunner.obj) : error LNK2038: mismatch detected for 'RuntimeLibrary': value 'MDd_DynamicDebug' doesn't match value 'MD_DynamicRelease' in ofxThreadedImageLoader.obj
1>openframeworksLib_debug.lib(ofURLFileLoader.obj) : error LNK2038: mismatch detected for '_ITERATOR_DEBUG_LEVEL': value '2' doesn't match value '0' in ofxThreadedImageLoader.obj
1>openframeworksLib_debug.lib(ofURLFileLoader.obj) : error LNK2038: mismatch detected for 'RuntimeLibrary': value 'MDd_DynamicDebug' doesn't match value 'MD_DynamicRelease' in ofxThreadedImageLoader.obj
1>openframeworksLib_debug.lib(ofImage.obj) : error LNK2038: mismatch detected for '_ITERATOR_DEBUG_LEVEL': value '2' doesn't match value '0' in ofxThreadedImageLoader.obj
1>openframeworksLib_debug.lib(ofImage.obj) : error LNK2038: mismatch detected for 'RuntimeLibrary': value 'MDd_DynamicDebug' doesn't match value 'MD_DynamicRelease' in ofxThreadedImageLoader.obj
1>openframeworksLib_debug.lib(ofTexture.obj) : error LNK2038: mismatch detected for '_ITERATOR_DEBUG_LEVEL': value '2' doesn't match value '0' in ofxThreadedImageLoader.obj
1>openframeworksLib_debug.lib(ofTexture.obj) : error LNK2038: mismatch detected for 'RuntimeLibrary': value 'MDd_DynamicDebug' doesn't match value 'MD_DynamicRelease' in ofxThreadedImageLoader.obj
1>openframeworksLib_debug.lib(ofMath.obj) : error LNK2038: mismatch detected for '_ITERATOR_DEBUG_LEVEL': value '2' doesn't match value '0' in ofxThreadedImageLoader.obj
1>openframeworksLib_debug.lib(ofMath.obj) : error LNK2038: mismatch detected for 'RuntimeLibrary': value 'MDd_DynamicDebug' doesn't match value 'MD_DynamicRelease' in ofxThreadedImageLoader.obj
1>openframeworksLib_debug.lib(ofGraphics.obj) : error LNK2038: mismatch detected for '_ITERATOR_DEBUG_LEVEL': value '2' doesn't match value '0' in ofxThreadedImageLoader.obj
1>openframeworksLib_debug.lib(ofGraphics.obj) : error LNK2038: mismatch detected for 'RuntimeLibrary': value 'MDd_DynamicDebug' doesn't match value 'MD_DynamicRelease' in ofxThreadedImageLoader.obj
1>openframeworksLib_debug.lib(ofColor.obj) : error LNK2038: mismatch detected for '_ITERATOR_DEBUG_LEVEL': value '2' doesn't match value '0' in ofxThreadedImageLoader.obj
1>openframeworksLib_debug.lib(ofColor.obj) : error LNK2038: mismatch detected for 'RuntimeLibrary': value 'MDd_DynamicDebug' doesn't match value 'MD_DynamicRelease' in ofxThreadedImageLoader.obj
1>openframeworksLib_debug.lib(ofPixels.obj) : error LNK2038: mismatch detected for '_ITERATOR_DEBUG_LEVEL': value '2' doesn't match value '0' in ofxThreadedImageLoader.obj
1>openframeworksLib_debug.lib(ofPixels.obj) : error LNK2038: mismatch detected for 'RuntimeLibrary': value 'MDd_DynamicDebug' doesn't match value 'MD_DynamicRelease' in ofxThreadedImageLoader.obj
1>openframeworksLib_debug.lib(ofTimer.obj) : error LNK2038: mismatch detected for '_ITERATOR_DEBUG_LEVEL': value '2' doesn't match value '0' in ofxThreadedImageLoader.obj
1>openframeworksLib_debug.lib(ofTimer.obj) : error LNK2038: mismatch detected for 'RuntimeLibrary': value 'MDd_DynamicDebug' doesn't match value 'MD_DynamicRelease' in ofxThreadedImageLoader.obj
1>openframeworksLib_debug.lib(ofFpsCounter.obj) : error LNK2038: mismatch detected for '_ITERATOR_DEBUG_LEVEL': value '2' doesn't match value '0' in ofxThreadedImageLoader.obj
1>openframeworksLib_debug.lib(ofFpsCounter.obj) : error LNK2038: mismatch detected for 'RuntimeLibrary': value 'MDd_DynamicDebug' doesn't match value 'MD_DynamicRelease' in ofxThreadedImageLoader.obj
1>openframeworksLib_debug.lib(ofMainLoop.obj) : error LNK2038: mismatch detected for '_ITERATOR_DEBUG_LEVEL': value '2' doesn't match value '0' in ofxThreadedImageLoader.obj
1>openframeworksLib_debug.lib(ofMainLoop.obj) : error LNK2038: mismatch detected for 'RuntimeLibrary': value 'MDd_DynamicDebug' doesn't match value 'MD_DynamicRelease' in ofxThreadedImageLoader.obj
1>openframeworksLib_debug.lib(ofRectangle.obj) : error LNK2038: mismatch detected for '_ITERATOR_DEBUG_LEVEL': value '2' doesn't match value '0' in ofxThreadedImageLoader.obj
1>openframeworksLib_debug.lib(ofRectangle.obj) : error LNK2038: mismatch detected for 'RuntimeLibrary': value 'MDd_DynamicDebug' doesn't match value 'MD_DynamicRelease' in ofxThreadedImageLoader.obj
1>openframeworksLib_debug.lib(ofAppGLFWWindow.obj) : error LNK2038: mismatch detected for '_ITERATOR_DEBUG_LEVEL': value '2' doesn't match value '0' in ofxThreadedImageLoader.obj
1>openframeworksLib_debug.lib(ofAppGLFWWindow.obj) : error LNK2038: mismatch detected for 'RuntimeLibrary': value 'MDd_DynamicDebug' doesn't match value 'MD_DynamicRelease' in ofxThreadedImageLoader.obj
1>openframeworksLib_debug.lib(ofGraphicsBaseTypes.obj) : error LNK2038: mismatch detected for '_ITERATOR_DEBUG_LEVEL': value '2' doesn't match value '0' in ofxThreadedImageLoader.obj
1>openframeworksLib_debug.lib(ofGraphicsBaseTypes.obj) : error LNK2038: mismatch detected for 'RuntimeLibrary': value 'MDd_DynamicDebug' doesn't match value 'MD_DynamicRelease' in ofxThreadedImageLoader.obj
1>openframeworksLib_debug.lib(ofGLUtils.obj) : error LNK2038: mismatch detected for '_ITERATOR_DEBUG_LEVEL': value '2' doesn't match value '0' in ofxThreadedImageLoader.obj
1>openframeworksLib_debug.lib(ofGLUtils.obj) : error LNK2038: mismatch detected for 'RuntimeLibrary': value 'MDd_DynamicDebug' doesn't match value 'MD_DynamicRelease' in ofxThreadedImageLoader.obj
1>openframeworksLib_debug.lib(ofGLProgrammableRenderer.obj) : error LNK2038: mismatch detected for '_ITERATOR_DEBUG_LEVEL': value '2' doesn't match value '0' in ofxThreadedImageLoader.obj
1>openframeworksLib_debug.lib(ofGLProgrammableRenderer.obj) : error LNK2038: mismatch detected for 'RuntimeLibrary': value 'MDd_DynamicDebug' doesn't match value 'MD_DynamicRelease' in ofxThreadedImageLoader.obj
1>openframeworksLib_debug.lib(ofBufferObject.obj) : error LNK2038: mismatch detected for '_ITERATOR_DEBUG_LEVEL': value '2' doesn't match value '0' in ofxThreadedImageLoader.obj
1>openframeworksLib_debug.lib(ofBufferObject.obj) : error LNK2038: mismatch detected for 'RuntimeLibrary': value 'MDd_DynamicDebug' doesn't match value 'MD_DynamicRelease' in ofxThreadedImageLoader.obj
1>openframeworksLib_debug.lib(ofVbo.obj) : error LNK2038: mismatch detected for '_ITERATOR_DEBUG_LEVEL': value '2' doesn't match value '0' in ofxThreadedImageLoader.obj
1>openframeworksLib_debug.lib(ofVbo.obj) : error LNK2038: mismatch detected for 'RuntimeLibrary': value 'MDd_DynamicDebug' doesn't match value 'MD_DynamicRelease' in ofxThreadedImageLoader.obj
1>openframeworksLib_debug.lib(ofVboMesh.obj) : error LNK2038: mismatch detected for '_ITERATOR_DEBUG_LEVEL': value '2' doesn't match value '0' in ofxThreadedImageLoader.obj
1>openframeworksLib_debug.lib(ofVboMesh.obj) : error LNK2038: mismatch detected for 'RuntimeLibrary': value 'MDd_DynamicDebug' doesn't match value 'MD_DynamicRelease' in ofxThreadedImageLoader.obj
1>openframeworksLib_debug.lib(ofPath.obj) : error LNK2038: mismatch detected for '_ITERATOR_DEBUG_LEVEL': value '2' doesn't match value '0' in ofxThreadedImageLoader.obj
1>openframeworksLib_debug.lib(ofPath.obj) : error LNK2038: mismatch detected for 'RuntimeLibrary': value 'MDd_DynamicDebug' doesn't match value 'MD_DynamicRelease' in ofxThreadedImageLoader.obj
1>openframeworksLib_debug.lib(ofShader.obj) : error LNK2038: mismatch detected for '_ITERATOR_DEBUG_LEVEL': value '2' doesn't match value '0' in ofxThreadedImageLoader.obj
1>openframeworksLib_debug.lib(ofShader.obj) : error LNK2038: mismatch detected for 'RuntimeLibrary': value 'MDd_DynamicDebug' doesn't match value 'MD_DynamicRelease' in ofxThreadedImageLoader.obj
1>openframeworksLib_debug.lib(ofCairoRenderer.obj) : error LNK2038: mismatch detected for '_ITERATOR_DEBUG_LEVEL': value '2' doesn't match value '0' in ofxThreadedImageLoader.obj
1>openframeworksLib_debug.lib(ofCairoRenderer.obj) : error LNK2038: mismatch detected for 'RuntimeLibrary': value 'MDd_DynamicDebug' doesn't match value 'MD_DynamicRelease' in ofxThreadedImageLoader.obj
1>openframeworksLib_debug.lib(ofGLRenderer.obj) : error LNK2038: mismatch detected for '_ITERATOR_DEBUG_LEVEL': value '2' doesn't match value '0' in ofxThreadedImageLoader.obj
1>openframeworksLib_debug.lib(ofGLRenderer.obj) : error LNK2038: mismatch detected for 'RuntimeLibrary': value 'MDd_DynamicDebug' doesn't match value 'MD_DynamicRelease' in ofxThreadedImageLoader.obj
1>openframeworksLib_debug.lib(ofMatrixStack.obj) : error LNK2038: mismatch detected for '_ITERATOR_DEBUG_LEVEL': value '2' doesn't match value '0' in ofxThreadedImageLoader.obj
1>openframeworksLib_debug.lib(ofMatrixStack.obj) : error LNK2038: mismatch detected for 'RuntimeLibrary': value 'MDd_DynamicDebug' doesn't match value 'MD_DynamicRelease' in ofxThreadedImageLoader.obj
1>openframeworksLib_debug.lib(ofNode.obj) : error LNK2038: mismatch detected for '_ITERATOR_DEBUG_LEVEL': value '2' doesn't match value '0' in ofxThreadedImageLoader.obj
1>openframeworksLib_debug.lib(ofNode.obj) : error LNK2038: mismatch detected for 'RuntimeLibrary': value 'MDd_DynamicDebug' doesn't match value 'MD_DynamicRelease' in ofxThreadedImageLoader.obj
1>openframeworksLib_debug.lib(ofBitmapFont.obj) : error LNK2038: mismatch detected for '_ITERATOR_DEBUG_LEVEL': value '2' doesn't match value '0' in ofxThreadedImageLoader.obj
1>openframeworksLib_debug.lib(ofBitmapFont.obj) : error LNK2038: mismatch detected for 'RuntimeLibrary': value 'MDd_DynamicDebug' doesn't match value 'MD_DynamicRelease' in ofxThreadedImageLoader.obj
1>openframeworksLib_debug.lib(ofFbo.obj) : error LNK2038: mismatch detected for '_ITERATOR_DEBUG_LEVEL': value '2' doesn't match value '0' in ofxThreadedImageLoader.obj
1>openframeworksLib_debug.lib(ofFbo.obj) : error LNK2038: mismatch detected for 'RuntimeLibrary': value 'MDd_DynamicDebug' doesn't match value 'MD_DynamicRelease' in ofxThreadedImageLoader.obj
1>openframeworksLib_debug.lib(ofCamera.obj) : error LNK2038: mismatch detected for '_ITERATOR_DEBUG_LEVEL': value '2' doesn't match value '0' in ofxThreadedImageLoader.obj
1>openframeworksLib_debug.lib(ofCamera.obj) : error LNK2038: mismatch detected for 'RuntimeLibrary': value 'MDd_DynamicDebug' doesn't match value 'MD_DynamicRelease' in ofxThreadedImageLoader.obj
1>openframeworksLib_debug.lib(ofTessellator.obj) : error LNK2038: mismatch detected for '_ITERATOR_DEBUG_LEVEL': value '2' doesn't match value '0' in ofxThreadedImageLoader.obj
1>openframeworksLib_debug.lib(ofTessellator.obj) : error LNK2038: mismatch detected for 'RuntimeLibrary': value 'MDd_DynamicDebug' doesn't match value 'MD_DynamicRelease' in ofxThreadedImageLoader.obj
1>openframeworksLib_debug.lib(ofParameterGroup.obj) : error LNK2038: mismatch detected for '_ITERATOR_DEBUG_LEVEL': value '2' doesn't match value '0' in ofxThreadedImageLoader.obj
1>openframeworksLib_debug.lib(ofParameterGroup.obj) : error LNK2038: mismatch detected for 'RuntimeLibrary': value 'MDd_DynamicDebug' doesn't match value 'MD_DynamicRelease' in ofxThreadedImageLoader.obj
1>openframeworksLib_debug.lib(of3dUtils.obj) : error LNK2038: mismatch detected for '_ITERATOR_DEBUG_LEVEL': value '2' doesn't match value '0' in ofxThreadedImageLoader.obj
1>openframeworksLib_debug.lib(of3dUtils.obj) : error LNK2038: mismatch detected for 'RuntimeLibrary': value 'MDd_DynamicDebug' doesn't match value 'MD_DynamicRelease' in ofxThreadedImageLoader.obj
1>openframeworksLib_debug.lib(ofLight.obj) : error LNK2038: mismatch detected for '_ITERATOR_DEBUG_LEVEL': value '2' doesn't match value '0' in ofxThreadedImageLoader.obj
1>openframeworksLib_debug.lib(ofLight.obj) : error LNK2038: mismatch detected for 'RuntimeLibrary': value 'MDd_DynamicDebug' doesn't match value 'MD_DynamicRelease' in ofxThreadedImageLoader.obj
1>openframeworksLib_debug.lib(ofParameter.obj) : error LNK2038: mismatch detected for '_ITERATOR_DEBUG_LEVEL': value '2' doesn't match value '0' in ofxThreadedImageLoader.obj
1>openframeworksLib_debug.lib(ofParameter.obj) : error LNK2038: mismatch detected for 'RuntimeLibrary': value 'MDd_DynamicDebug' doesn't match value 'MD_DynamicRelease' in ofxThreadedImageLoader.obj
1>   Creating library bin\ww004.lib and object bin\ww004.exp
1>LINK : warning LNK4098: defaultlib 'MSVCRTD' conflicts with use of other libs; use /NODEFAULTLIB:library
1>openframeworksLib_debug.lib(ofParameter.obj) : error LNK2001: unresolved external symbol __imp___invalid_parameter
1>openframeworksLib_debug.lib(ofFbo.obj) : error LNK2001: unresolved external symbol __imp___invalid_parameter
1>openframeworksLib_debug.lib(ofTessellator.obj) : error LNK2001: unresolved external symbol __imp___invalid_parameter
1>openframeworksLib_debug.lib(ofParameterGroup.obj) : error LNK2001: unresolved external symbol __imp___invalid_parameter
1>openframeworksLib_debug.lib(ofLight.obj) : error LNK2001: unresolved external symbol __imp___invalid_parameter
1>openframeworksLib_debug.lib(ofGLRenderer.obj) : error LNK2001: unresolved external symbol __imp___invalid_parameter
1>openframeworksLib_debug.lib(ofMatrixStack.obj) : error LNK2001: unresolved external symbol __imp___invalid_parameter
1>openframeworksLib_debug.lib(ofNode.obj) : error LNK2001: unresolved external symbol __imp___invalid_parameter
1>openframeworksLib_debug.lib(ofBitmapFont.obj) : error LNK2001: unresolved external symbol __imp___invalid_parameter
1>openframeworksLib_debug.lib(ofFmodSoundPlayer.obj) : error LNK2001: unresolved external symbol __imp___invalid_parameter
1>openframeworksLib_debug.lib(of3dPrimitives.obj) : error LNK2001: unresolved external symbol __imp___invalid_parameter
1>openframeworksLib_debug.lib(ofRendererCollection.obj) : error LNK2001: unresolved external symbol __imp___invalid_parameter
1>openframeworksLib_debug.lib(ofCairoRenderer.obj) : error LNK2001: unresolved external symbol __imp___invalid_parameter
1>openframeworksLib_debug.lib(ofPath.obj) : error LNK2001: unresolved external symbol __imp___invalid_parameter
1>openframeworksLib_debug.lib(ofShader.obj) : error LNK2001: unresolved external symbol __imp___invalid_parameter
1>openframeworksLib_debug.lib(of3dGraphics.obj) : error LNK2001: unresolved external symbol __imp___invalid_parameter
1>openframeworksLib_debug.lib(ofSoundBuffer.obj) : error LNK2001: unresolved external symbol __imp___invalid_parameter
1>openframeworksLib_debug.lib(ofGLUtils.obj) : error LNK2001: unresolved external symbol __imp___invalid_parameter
1>openframeworksLib_debug.lib(ofGLProgrammableRenderer.obj) : error LNK2001: unresolved external symbol __imp___invalid_parameter
1>openframeworksLib_debug.lib(ofVbo.obj) : error LNK2001: unresolved external symbol __imp___invalid_parameter
1>openframeworksLib_debug.lib(ofVboMesh.obj) : error LNK2001: unresolved external symbol __imp___invalid_parameter
1>openframeworksLib_debug.lib(ofFpsCounter.obj) : error LNK2001: unresolved external symbol __imp___invalid_parameter
1>openframeworksLib_debug.lib(ofMainLoop.obj) : error LNK2001: unresolved external symbol __imp___invalid_parameter
1>openframeworksLib_debug.lib(ofRectangle.obj) : error LNK2001: unresolved external symbol __imp___invalid_parameter
1>openframeworksLib_debug.lib(ofAppGLFWWindow.obj) : error LNK2001: unresolved external symbol __imp___invalid_parameter
1>openframeworksLib_debug.lib(ofUtils.obj) : error LNK2001: unresolved external symbol __imp___invalid_parameter
1>openframeworksLib_debug.lib(ofMath.obj) : error LNK2001: unresolved external symbol __imp___invalid_parameter
1>openframeworksLib_debug.lib(ofGraphics.obj) : error LNK2001: unresolved external symbol __imp___invalid_parameter
1>openframeworksLib_debug.lib(ofPixels.obj) : error LNK2001: unresolved external symbol __imp___invalid_parameter
1>openframeworksLib_debug.lib(ofBaseTypes.obj) : error LNK2001: unresolved external symbol __imp___invalid_parameter
1>openframeworksLib_debug.lib(ofBaseApp.obj) : error LNK2001: unresolved external symbol __imp___invalid_parameter
1>openframeworksLib_debug.lib(ofSoundPlayer.obj) : error LNK2001: unresolved external symbol __imp___invalid_parameter
1>openframeworksLib_debug.lib(ofFileUtils.obj) : error LNK2001: unresolved external symbol __imp___invalid_parameter
1>openframeworksLib_debug.lib(ofURLFileLoader.obj) : error LNK2001: unresolved external symbol __imp___invalid_parameter
1>openframeworksLib_debug.lib(ofImage.obj) : error LNK2001: unresolved external symbol __imp___invalid_parameter
1>openframeworksLib_debug.lib(ofTexture.obj) : error LNK2001: unresolved external symbol __imp___invalid_parameter
1>openframeworksLib_debug.lib(ofTrueTypeFont.obj) : error LNK2001: unresolved external symbol __imp___invalid_parameter
1>openframeworksLib_debug.lib(ofThread.obj) : error LNK2001: unresolved external symbol __imp___invalid_parameter
1>openframeworksLib_debug.lib(ofLog.obj) : error LNK2001: unresolved external symbol __imp___invalid_parameter
1>openframeworksLib_debug.lib(ofEvents.obj) : error LNK2001: unresolved external symbol __imp___invalid_parameter
1>openframeworksLib_debug.lib(ofAppRunner.obj) : error LNK2001: unresolved external symbol __imp___invalid_parameter
1>openframeworksLib_debug.lib(ofParameter.obj) : error LNK2001: unresolved external symbol __imp___calloc_dbg
1>openframeworksLib_debug.lib(ofTessellator.obj) : error LNK2001: unresolved external symbol __imp___calloc_dbg
1>openframeworksLib_debug.lib(ofParameterGroup.obj) : error LNK2001: unresolved external symbol __imp___calloc_dbg
1>openframeworksLib_debug.lib(of3dUtils.obj) : error LNK2001: unresolved external symbol __imp___calloc_dbg
1>openframeworksLib_debug.lib(ofLight.obj) : error LNK2001: unresolved external symbol __imp___calloc_dbg
1>openframeworksLib_debug.lib(ofNode.obj) : error LNK2001: unresolved external symbol __imp___calloc_dbg
1>openframeworksLib_debug.lib(ofBitmapFont.obj) : error LNK2001: unresolved external symbol __imp___calloc_dbg
1>openframeworksLib_debug.lib(ofFbo.obj) : error LNK2001: unresolved external symbol __imp___calloc_dbg
1>openframeworksLib_debug.lib(ofCamera.obj) : error LNK2001: unresolved external symbol __imp___calloc_dbg
1>openframeworksLib_debug.lib(ofRendererCollection.obj) : error LNK2001: unresolved external symbol __imp___calloc_dbg
1>openframeworksLib_debug.lib(ofCairoRenderer.obj) : error LNK2001: unresolved external symbol __imp___calloc_dbg
1>openframeworksLib_debug.lib(ofGLRenderer.obj) : error LNK2001: unresolved external symbol __imp___calloc_dbg
1>openframeworksLib_debug.lib(ofMatrixStack.obj) : error LNK2001: unresolved external symbol __imp___calloc_dbg
1>openframeworksLib_debug.lib(of3dGraphics.obj) : error LNK2001: unresolved external symbol __imp___calloc_dbg
1>openframeworksLib_debug.lib(ofSoundBuffer.obj) : error LNK2001: unresolved external symbol __imp___calloc_dbg
1>openframeworksLib_debug.lib(ofFmodSoundPlayer.obj) : error LNK2001: unresolved external symbol __imp___calloc_dbg
1>openframeworksLib_debug.lib(of3dPrimitives.obj) : error LNK2001: unresolved external symbol __imp___calloc_dbg
1>openframeworksLib_debug.lib(ofVbo.obj) : error LNK2001: unresolved external symbol __imp___calloc_dbg
1>openframeworksLib_debug.lib(ofVboMesh.obj) : error LNK2001: unresolved external symbol __imp___calloc_dbg
1>openframeworksLib_debug.lib(ofPath.obj) : error LNK2001: unresolved external symbol __imp___calloc_dbg
1>openframeworksLib_debug.lib(ofShader.obj) : error LNK2001: unresolved external symbol __imp___calloc_dbg
1>openframeworksLib_debug.lib(ofAppGLFWWindow.obj) : error LNK2001: unresolved external symbol __imp___calloc_dbg
1>openframeworksLib_debug.lib(ofGLUtils.obj) : error LNK2001: unresolved external symbol __imp___calloc_dbg
1>openframeworksLib_debug.lib(ofGLProgrammableRenderer.obj) : error LNK2001: unresolved external symbol __imp___calloc_dbg
1>openframeworksLib_debug.lib(ofBufferObject.obj) : error LNK2001: unresolved external symbol __imp___calloc_dbg
1>openframeworksLib_debug.lib(ofTimer.obj) : error LNK2001: unresolved external symbol __imp___calloc_dbg
1>openframeworksLib_debug.lib(ofFpsCounter.obj) : error LNK2001: unresolved external symbol __imp___calloc_dbg
1>openframeworksLib_debug.lib(ofMainLoop.obj) : error LNK2001: unresolved external symbol __imp___calloc_dbg
1>openframeworksLib_debug.lib(ofRectangle.obj) : error LNK2001: unresolved external symbol __imp___calloc_dbg
1>openframeworksLib_debug.lib(ofUtils.obj) : error LNK2001: unresolved external symbol __imp___calloc_dbg
1>openframeworksLib_debug.lib(ofMath.obj) : error LNK2001: unresolved external symbol __imp___calloc_dbg
1>openframeworksLib_debug.lib(ofGraphics.obj) : error LNK2001: unresolved external symbol __imp___calloc_dbg
1>openframeworksLib_debug.lib(ofPixels.obj) : error LNK2001: unresolved external symbol __imp___calloc_dbg
1>openframeworksLib_debug.lib(ofBaseTypes.obj) : error LNK2001: unresolved external symbol __imp___calloc_dbg
1>openframeworksLib_debug.lib(ofBaseApp.obj) : error LNK2001: unresolved external symbol __imp___calloc_dbg
1>openframeworksLib_debug.lib(ofSoundPlayer.obj) : error LNK2001: unresolved external symbol __imp___calloc_dbg
1>openframeworksLib_debug.lib(ofFileUtils.obj) : error LNK2001: unresolved external symbol __imp___calloc_dbg
1>openframeworksLib_debug.lib(ofURLFileLoader.obj) : error LNK2001: unresolved external symbol __imp___calloc_dbg
1>openframeworksLib_debug.lib(ofImage.obj) : error LNK2001: unresolved external symbol __imp___calloc_dbg
1>openframeworksLib_debug.lib(ofTexture.obj) : error LNK2001: unresolved external symbol __imp___calloc_dbg
1>openframeworksLib_debug.lib(ofTrueTypeFont.obj) : error LNK2001: unresolved external symbol __imp___calloc_dbg
1>openframeworksLib_debug.lib(ofThread.obj) : error LNK2001: unresolved external symbol __imp___calloc_dbg
1>openframeworksLib_debug.lib(ofLog.obj) : error LNK2001: unresolved external symbol __imp___calloc_dbg
1>openframeworksLib_debug.lib(ofEvents.obj) : error LNK2001: unresolved external symbol __imp___calloc_dbg
1>openframeworksLib_debug.lib(ofAppRunner.obj) : error LNK2001: unresolved external symbol __imp___calloc_dbg
1>openframeworksLib_debug.lib(ofParameter.obj) : error LNK2001: unresolved external symbol __imp___CrtDbgReport
1>openframeworksLib_debug.lib(ofFbo.obj) : error LNK2001: unresolved external symbol __imp___CrtDbgReport
1>openframeworksLib_debug.lib(ofTessellator.obj) : error LNK2001: unresolved external symbol __imp___CrtDbgReport
1>openframeworksLib_debug.lib(ofParameterGroup.obj) : error LNK2001: unresolved external symbol __imp___CrtDbgReport
1>openframeworksLib_debug.lib(ofLight.obj) : error LNK2001: unresolved external symbol __imp___CrtDbgReport
1>openframeworksLib_debug.lib(ofGLRenderer.obj) : error LNK2001: unresolved external symbol __imp___CrtDbgReport
1>openframeworksLib_debug.lib(ofMatrixStack.obj) : error LNK2001: unresolved external symbol __imp___CrtDbgReport
1>openframeworksLib_debug.lib(ofNode.obj) : error LNK2001: unresolved external symbol __imp___CrtDbgReport
1>openframeworksLib_debug.lib(ofBitmapFont.obj) : error LNK2001: unresolved external symbol __imp___CrtDbgReport
1>openframeworksLib_debug.lib(ofFmodSoundPlayer.obj) : error LNK2001: unresolved external symbol __imp___CrtDbgReport
1>openframeworksLib_debug.lib(of3dPrimitives.obj) : error LNK2001: unresolved external symbol __imp___CrtDbgReport
1>openframeworksLib_debug.lib(ofRendererCollection.obj) : error LNK2001: unresolved external symbol __imp___CrtDbgReport
1>openframeworksLib_debug.lib(ofCairoRenderer.obj) : error LNK2001: unresolved external symbol __imp___CrtDbgReport
1>openframeworksLib_debug.lib(ofPath.obj) : error LNK2001: unresolved external symbol __imp___CrtDbgReport
1>openframeworksLib_debug.lib(ofShader.obj) : error LNK2001: unresolved external symbol __imp___CrtDbgReport
1>openframeworksLib_debug.lib(of3dGraphics.obj) : error LNK2001: unresolved external symbol __imp___CrtDbgReport
1>openframeworksLib_debug.lib(ofSoundBuffer.obj) : error LNK2001: unresolved external symbol __imp___CrtDbgReport
1>openframeworksLib_debug.lib(ofGLUtils.obj) : error LNK2001: unresolved external symbol __imp___CrtDbgReport
1>openframeworksLib_debug.lib(ofGLProgrammableRenderer.obj) : error LNK2001: unresolved external symbol __imp___CrtDbgReport
1>openframeworksLib_debug.lib(ofVbo.obj) : error LNK2001: unresolved external symbol __imp___CrtDbgReport
1>openframeworksLib_debug.lib(ofVboMesh.obj) : error LNK2001: unresolved external symbol __imp___CrtDbgReport
1>openframeworksLib_debug.lib(ofFpsCounter.obj) : error LNK2001: unresolved external symbol __imp___CrtDbgReport
1>openframeworksLib_debug.lib(ofMainLoop.obj) : error LNK2001: unresolved external symbol __imp___CrtDbgReport
1>openframeworksLib_debug.lib(ofRectangle.obj) : error LNK2001: unresolved external symbol __imp___CrtDbgReport
1>openframeworksLib_debug.lib(ofAppGLFWWindow.obj) : error LNK2001: unresolved external symbol __imp___CrtDbgReport
1>openframeworksLib_debug.lib(ofUtils.obj) : error LNK2001: unresolved external symbol __imp___CrtDbgReport
1>openframeworksLib_debug.lib(ofMath.obj) : error LNK2001: unresolved external symbol __imp___CrtDbgReport
1>openframeworksLib_debug.lib(ofGraphics.obj) : error LNK2001: unresolved external symbol __imp___CrtDbgReport
1>openframeworksLib_debug.lib(ofPixels.obj) : error LNK2001: unresolved external symbol __imp___CrtDbgReport
1>openframeworksLib_debug.lib(ofBaseTypes.obj) : error LNK2001: unresolved external symbol __imp___CrtDbgReport
1>openframeworksLib_debug.lib(ofBaseApp.obj) : error LNK2001: unresolved external symbol __imp___CrtDbgReport
1>openframeworksLib_debug.lib(ofSoundPlayer.obj) : error LNK2001: unresolved external symbol __imp___CrtDbgReport
1>openframeworksLib_debug.lib(ofFileUtils.obj) : error LNK2001: unresolved external symbol __imp___CrtDbgReport
1>openframeworksLib_debug.lib(ofURLFileLoader.obj) : error LNK2001: unresolved external symbol __imp___CrtDbgReport
1>openframeworksLib_debug.lib(ofImage.obj) : error LNK2001: unresolved external symbol __imp___CrtDbgReport
1>openframeworksLib_debug.lib(ofTexture.obj) : error LNK2001: unresolved external symbol __imp___CrtDbgReport
1>openframeworksLib_debug.lib(ofTrueTypeFont.obj) : error LNK2001: unresolved external symbol __imp___CrtDbgReport
1>openframeworksLib_debug.lib(ofThread.obj) : error LNK2001: unresolved external symbol __imp___CrtDbgReport
1>openframeworksLib_debug.lib(ofLog.obj) : error LNK2001: unresolved external symbol __imp___CrtDbgReport
1>openframeworksLib_debug.lib(ofEvents.obj) : error LNK2001: unresolved external symbol __imp___CrtDbgReport
1>openframeworksLib_debug.lib(ofAppRunner.obj) : error LNK2001: unresolved external symbol __imp___CrtDbgReport
1>bin\ww004.exe : fatal error LNK1120: 3 unresolved externals
1>Done building project "ww004.vcxproj" -- FAILED.
========== Build: 0 succeeded, 1 failed, 0 up-to-date, 0 skipped ==========

Also, I can’t run it in 64bits in Debug nor Release. I need to use another set of OpenFrameworks files for this? I’m only using ofxThreadeImagesLoader add on.

Thanks for any hint!