Building errors with Msys2

Hi,all
I met some errors as following by Msys2:
makefileCommon/compile.core.mk:239: recipe for target ‘/g/Drawing_software/AR/Of/of_v0.9.0_msys2_release/libs/openFrameworksCompiled/lib/msys2/obj/Release/libs/openFrameworks/utils/ofUtils.o’ failed
make[2]: *** [/g/Drawing_software/AR/Of/of_v0.9.0_msys2_release/libs/openFrameworksCompiled/lib/msys2/obj/Release/libs/openFrameworks/utils/ofUtils.o] Error 1
makefileCommon/compile.core.mk:205: recipe for target ‘Release’ failed
make[1]: *** [Release] Error 2
make[1]: Leaving directory ‘/g/Drawing_software/AR/Of/of_v0.9.0_msys2_release/libs/openFrameworksCompiled/project’
/g/Drawing_software/AR/Of/of_v0.9.0_msys2_release/libs/openFrameworksCompiled/project/makefileCommon/compile.project.mk:126: recipe for target ‘Release’ failed
make: *** [Release] Error 2

How can I do! I install it by the guide online-http://openframeworks.cc/setup/msys2/

Thanks a lot!

There is a bug in the release version of OF. Workaround has been discussed here.
Hope it helps.